Target
Sigma non-opioid intracellular receptor 1
Ligand
BDBM50374606
Substrate
Meas. Tech.
Receptor Assay
Ki
5.22±1.11 nM
Citation
 McCurdy, CRMesangeau, CChin, FTJames, MLShen, BGambhir, S Highly selective sigma receptor radioligands US Patent  US9604926 Publication Date 3/28/2017 
Target
Name:
Sigma non-opioid intracellular receptor 1
Synonyms:
Opioid receptor, sigma 1 SGMR1_MOUSE Sigma1-receptor Sigmar1
Type:
Enzyme Catalytic Domain
Mol. Mass.:
25246.51
Organism:
Mus musculus (Mouse)
Description:
O55242
Residue:
223
  
Inhibitor
Name:
BDBM50374606
Synonyms:
CHEMBL405925 US9724435, Compound CM-124
Type:
Small organic molecule
Emp. Form.:
C20H29N3O2
Mol. Mass.:
343.4632
SMILES:
O=c1oc2ccccc2n1CCCN1CCN(CC1)C1CCCCC1
: