Target
Sigma non-opioid intracellular receptor 1
Ligand
BDBM50374599
Substrate
Meas. Tech.
Receptor Assay
Ki
6.90±0.37 nM
Citation
 McCurdy, CRMesangeau, CChin, FTJames, MLShen, BGambhir, S Highly selective sigma receptor radioligands US Patent  US9604926 Publication Date 3/28/2017 
Target
Name:
Sigma non-opioid intracellular receptor 1
Synonyms:
Opioid receptor, sigma 1 SGMR1_MOUSE Sigma1-receptor Sigmar1
Type:
Enzyme Catalytic Domain
Mol. Mass.:
25246.51
Organism:
Mus musculus (Mouse)
Description:
O55242
Residue:
223
  
Inhibitor
Name:
BDBM50374599
Synonyms:
CHEMBL269876 US9724435, Compound CM-129
Type:
Small organic molecule
Emp. Form.:
C19H27N3O2
Mol. Mass.:
329.4366
SMILES:
O=c1oc2ccccc2n1CCN1CCN(CC1)C1CCCCC1
: