Target
Sigma intracellular receptor 2
Ligand
BDBM312152
Substrate
Meas. Tech.
Receptor Assay
Ki
4.47±0.42 nM
Citation
 McCurdy, CRMesangeau, CChin, FTJames, MLShen, BGambhir, S Highly selective sigma receptor radioligands US Patent  US9604926 Publication Date 3/28/2017 
Target
Name:
Sigma intracellular receptor 2
Synonyms:
S2r Sigma-2 receptor Tmem97 | Transmembrane protein 97
Type:
Mol. Mass.:
20818.69
Organism:
Mus musculus (Mouse)
Description:
Q8VD00
Residue:
176
  
Inhibitor
Name:
BDBM312152
Synonyms:
US9604926, Compound CM-138 | US9724435, Compound CM-138
Type:
Small organic molecule
Emp. Form.:
C21H30BrN3O2
Mol. Mass.:
436.386
SMILES:
Brc1ccc2n(CCCCN3CCN(CC3)C3CCCCC3)c(=O)oc2c1
: