Target
Sigma intracellular receptor 2
Ligand
BDBM50353844
Substrate
Meas. Tech.
Receptor Assay
Ki
0.390±0.06 nM
Citation
 McCurdy, CRMesangeau, CChin, FTJames, MLShen, BGambhir, S Highly selective sigma receptor radioligands US Patent  US9604926 Publication Date 3/28/2017 
Target
Name:
Sigma intracellular receptor 2
Synonyms:
S2r Sigma-2 receptor Tmem97 | Transmembrane protein 97
Type:
Mol. Mass.:
20818.69
Organism:
Mus musculus (Mouse)
Description:
Q8VD00
Residue:
176
  
Inhibitor
Name:
BDBM50353844
Synonyms:
CHEMBL270341 US9724435, Compound CM-145
Type:
Small organic molecule
Emp. Form.:
C21H31N3OS
Mol. Mass.:
373.555
SMILES:
O=c1sc2ccccc2n1CCCCN1CCN(CC1)C1CCCCC1
: