Target
Sigma non-opioid intracellular receptor 1
Ligand
BDBM50374598
Substrate
Meas. Tech.
Receptor Assay
Ki
1.28±0.38 nM
Citation
 McCurdy, CRMesangeau, CChin, FTJames, MLShen, BGambhir, S Highly selective sigma receptor radioligands US Patent  US9604926 Publication Date 3/28/2017 
Target
Name:
Sigma non-opioid intracellular receptor 1
Synonyms:
Opioid receptor, sigma 1 SGMR1_MOUSE Sigma1-receptor Sigmar1
Type:
Enzyme Catalytic Domain
Mol. Mass.:
25246.51
Organism:
Mus musculus (Mouse)
Description:
O55242
Residue:
223
  
Inhibitor
Name:
BDBM50374598
Synonyms:
CHEMBL272603 US9724435, Compound CM-156
Type:
Small organic molecule
Emp. Form.:
C21H31N3S2
Mol. Mass.:
389.621
SMILES:
S=c1sc2ccccc2n1CCCCN1CCN(CC1)C1CCCCC1
: