Target
Sigma intracellular receptor 2
Ligand
BDBM312166
Substrate
Meas. Tech.
Receptor Assay
Ki
0.700±0.11 nM
Citation
 McCurdy, CRMesangeau, CChin, FTJames, MLShen, BGambhir, S Highly selective sigma receptor radioligands US Patent  US9604926 Publication Date 3/28/2017 
Target
Name:
Sigma intracellular receptor 2
Synonyms:
S2r Sigma-2 receptor Tmem97 | Transmembrane protein 97
Type:
Mol. Mass.:
20818.69
Organism:
Mus musculus (Mouse)
Description:
Q8VD00
Residue:
176
  
Inhibitor
Name:
BDBM312166
Synonyms:
US9604926, Compound CM-170 | US9724435, Compound CM-170
Type:
Small organic molecule
Emp. Form.:
C21H24FN3O2
Mol. Mass.:
369.4326
SMILES:
Fc1ccc(cc1)N1CCN(CCCCn2c3ccccc3oc2=O)CC1
: