Target
Sigma non-opioid intracellular receptor 1
Ligand
BDBM312167
Substrate
Meas. Tech.
Receptor Assay
Ki
0.940±0.13 nM
Citation
 McCurdy, CRMesangeau, CChin, FTJames, MLShen, BGambhir, S Highly selective sigma receptor radioligands US Patent  US9604926 Publication Date 3/28/2017 
Target
Name:
Sigma non-opioid intracellular receptor 1
Synonyms:
Opioid receptor, sigma 1 SGMR1_MOUSE Sigma1-receptor Sigmar1
Type:
Enzyme Catalytic Domain
Mol. Mass.:
25246.51
Organism:
Mus musculus (Mouse)
Description:
O55242
Residue:
223
  
Inhibitor
Name:
BDBM312167
Synonyms:
US9604926, Compound CM-171 | US9724435, Compound CM-171
Type:
Small organic molecule
Emp. Form.:
C22H33N3O2
Mol. Mass.:
371.5163
SMILES:
O=c1oc2ccccc2n1CCCCN1CCN(CC2CCCCC2)CC1
: