Target
Sigma intracellular receptor 2
Ligand
BDBM312185
Substrate
Meas. Tech.
Receptor Assay
Ki
0.560±0.12 nM
Citation
 McCurdy, CRMesangeau, CChin, FTJames, MLShen, BGambhir, S Highly selective sigma receptor radioligands US Patent  US9604926 Publication Date 3/28/2017 
Target
Name:
Sigma intracellular receptor 2
Synonyms:
S2r Sigma-2 receptor Tmem97 | Transmembrane protein 97
Type:
Mol. Mass.:
20818.69
Organism:
Mus musculus (Mouse)
Description:
Q8VD00
Residue:
176
  
Inhibitor
Name:
BDBM312185
Synonyms:
US9604926, Compound CM-308 | US9724435, Compound CM-308
Type:
Small organic molecule
Emp. Form.:
C22H26N2O2S2
Mol. Mass.:
414.584
SMILES:
COc1cc2CCN(CCCCn3c4ccccc4sc3=S)Cc2cc1OC
: