Target
Sigma intracellular receptor 2
Ligand
BDBM312199
Substrate
Meas. Tech.
Receptor Assay
Ki
0.006±0.00096 nM
Citation
 McCurdy, CRMesangeau, CChin, FTJames, MLShen, BGambhir, S Highly selective sigma receptor radioligands US Patent  US9604926 Publication Date 3/28/2017 
Target
Name:
Sigma intracellular receptor 2
Synonyms:
S2r Sigma-2 receptor Tmem97 | Transmembrane protein 97
Type:
Mol. Mass.:
20818.69
Organism:
Mus musculus (Mouse)
Description:
Q8VD00
Residue:
176
  
Inhibitor
Name:
BDBM312199
Synonyms:
US9604926, Compound CM-366
Type:
Small organic molecule
Emp. Form.:
C27H35FN4O
Mol. Mass.:
450.5914
SMILES:
Fc1ccc(cc1)-c1ccc2[nH]c(=O)n(CCCCN3CCN(CC3)C3CCCCC3)c2c1
: