Target
Sigma intracellular receptor 2
Ligand
BDBM312230
Substrate
Meas. Tech.
Receptor Assay
Ki
3.15±0.19 nM
Citation
 McCurdy, CRMesangeau, CChin, FTJames, MLShen, BGambhir, S Highly selective sigma receptor radioligands US Patent  US9604926 Publication Date 3/28/2017 
Target
Name:
Sigma intracellular receptor 2
Synonyms:
S2r Sigma-2 receptor Tmem97 | Transmembrane protein 97
Type:
Mol. Mass.:
20818.69
Organism:
Mus musculus (Mouse)
Description:
Q8VD00
Residue:
176
  
Inhibitor
Name:
BDBM312230
Synonyms:
US9604926, Compound AZ-57 | US9724435, Compound AZ-57
Type:
Small organic molecule
Emp. Form.:
C22H33N3OS
Mol. Mass.:
387.582
SMILES:
CC(CCCn1c2ccccc2sc1=O)N1CCN(CC1)C1CCCCC1
: