Target
Amine oxidase [flavin-containing] B
Ligand
BDBM179451
Substrate
Meas. Tech.
Monoamine Oxidase Assays
pH
7.5±n/a
Ki
550±n/a nM
Comments
extracted
Citation
 Fyfe, MCOrtega Muñoz, ACastro-Palomino Laria, JMartinell Pedemonte, MEstiarte-Martinez, MValls Vidal, N Cyclopropylamine derivatives useful as LSD1 inhibitors US Patent  US9676701 Publication Date 6/13/2017 
Target
Name:
Amine oxidase [flavin-containing] B
Synonyms:
AOFB_HUMAN MAOB Monoamine oxidase type B (MAO B) Monoamine oxidase type B (MAOB)
Type:
Protein
Mol. Mass.:
58768.76
Organism:
Homo sapiens (Human)
Description:
P27338
Residue:
520
  
Inhibitor
Name:
BDBM179451
Synonyms:
US9676701, 5 (trans)-2-(6-(3-(trifluoromethyl)phenyl)pyridin-3-yl)cyclopropanamine dihydrochloride
Type:
Small organic molecule
Emp. Form.:
C15H13F3N2
Mol. Mass.:
278.2723
SMILES:
N[C@H]1C[C@@H]1c1ccc(nc1)-c1cccc(c1)C(F)(F)F
: