Target
Amine oxidase [flavin-containing] A
Ligand
BDBM179739
Substrate
Meas. Tech.
Monoamine Oxidase Assays
pH
7.5±n/a
Ki
>1000±n/a nM
Comments
extracted
Citation
 Fyfe, MCOrtega Muñoz, ACastro-Palomino Laria, JMartinell Pedemonte, MEstiarte-Martinez, MValls Vidal, N Cyclopropylamine derivatives useful as LSD1 inhibitors US Patent  US9676701 Publication Date 6/13/2017 
Target
Name:
Amine oxidase [flavin-containing] A
Synonyms:
AOFA_HUMAN MAO-A Monoamine oxidase Monoamine oxidase type A (MAO A) Monoamine oxidase type A (MAOA)
Type:
Protein
Mol. Mass.:
59689.53
Organism:
Homo sapiens (Human)
Description:
P21397
Residue:
527
  
Inhibitor
Name:
BDBM179739
Synonyms:
US9676701, 52 N-(3-(5-((trans)-2-aminocyclopropyl)pyridin-2-yl)phenyl)acetamide hydrochloride
Type:
Small organic molecule
Emp. Form.:
C16H17N3O
Mol. Mass.:
267.3257
SMILES:
CC(=O)Nc1cccc(c1)-c1ccc(cn1)[C@H]1C[C@@H]1N
: