Target
Amine oxidase [flavin-containing] B
Ligand
BDBM179749
Substrate
Meas. Tech.
Monoamine Oxidase Assays
pH
7.5±n/a
Ki
>1000±n/a nM
Comments
extracted
Citation
 Fyfe, MCOrtega Muñoz, ACastro-Palomino Laria, JMartinell Pedemonte, MEstiarte-Martinez, MValls Vidal, N Cyclopropylamine derivatives useful as LSD1 inhibitors US Patent  US9676701 Publication Date 6/13/2017 
Target
Name:
Amine oxidase [flavin-containing] B
Synonyms:
AOFB_HUMAN MAOB Monoamine oxidase type B (MAO B) Monoamine oxidase type B (MAOB)
Type:
Protein
Mol. Mass.:
58768.76
Organism:
Homo sapiens (Human)
Description:
P27338
Residue:
520
  
Inhibitor
Name:
BDBM179749
Synonyms:
US9676701, 57 (trans)-2-(6-(4-methylthiophen-3-yl)pyridin-3-yl)cyclopropanamine hydrochloride
Type:
Small organic molecule
Emp. Form.:
C13H14N2S
Mol. Mass.:
230.329
SMILES:
Cc1cscc1-c1ccc(cn1)[C@H]1C[C@@H]1N
: