Target
Amine oxidase [flavin-containing] A
Ligand
BDBM179826
Substrate
Meas. Tech.
Monoamine Oxidase Assays
pH
7.5±n/a
Ki
>1000±n/a nM
Comments
extracted
Citation
 Fyfe, MCOrtega Muñoz, ACastro-Palomino Laria, JMartinell Pedemonte, MEstiarte-Martinez, MValls Vidal, N Cyclopropylamine derivatives useful as LSD1 inhibitors US Patent  US9676701 Publication Date 6/13/2017 
Target
Name:
Amine oxidase [flavin-containing] A
Synonyms:
AOFA_HUMAN MAO-A Monoamine oxidase Monoamine oxidase type A (MAO A) Monoamine oxidase type A (MAOA)
Type:
Protein
Mol. Mass.:
59689.53
Organism:
Homo sapiens (Human)
Description:
P21397
Residue:
527
  
Inhibitor
Name:
BDBM179826
Synonyms:
US9676701, 62 6-(5-((trans)-2-aminocyclopropyl)pyridin-2-yl)indolin-2-one hydrochloride
Type:
Small organic molecule
Emp. Form.:
C16H15N3O
Mol. Mass.:
265.3098
SMILES:
N[C@H]1C[C@@H]1c1ccc(nc1)-c1ccc2CC(=O)Nc2c1
: