Target
Amine oxidase [flavin-containing] A
Ligand
BDBM179865
Substrate
Meas. Tech.
Monoamine Oxidase Assays
pH
7.5±n/a
Ki
550±n/a nM
Comments
extracted
Citation
 Fyfe, MCOrtega Muñoz, ACastro-Palomino Laria, JMartinell Pedemonte, MEstiarte-Martinez, MValls Vidal, N Cyclopropylamine derivatives useful as LSD1 inhibitors US Patent  US9676701 Publication Date 6/13/2017 
Target
Name:
Amine oxidase [flavin-containing] A
Synonyms:
AOFA_HUMAN MAO-A Monoamine oxidase Monoamine oxidase type A (MAO A) Monoamine oxidase type A (MAOA)
Type:
Protein
Mol. Mass.:
59689.53
Organism:
Homo sapiens (Human)
Description:
P21397
Residue:
527
  
Inhibitor
Name:
BDBM179865
Synonyms:
US9676701, 99 N-(3-(5-((trans)-2-aminocyclopropyl)pyridin-2-yl)phenyl)-4-cyanobenzenesulfonamide hydrochloride
Type:
Small organic molecule
Emp. Form.:
C21H18N4O2S
Mol. Mass.:
390.458
SMILES:
N[C@H]1C[C@@H]1c1ccc(nc1)-c1cccc(NS(=O)(=O)c2ccc(cc2)C#N)c1
: