Target
Fatty acid-binding protein, adipocyte
Ligand
BDBM312376
Substrate
Meas. Tech.
Time Resolved-Fluorescence Energy Transfer (TR-FRET) Assay
IC50
40.0±n/a nM
Citation
 Buettelmann, BCeccarelli, SMKuehne, HKuhn, BNeidhart, WObst Sander, URichter, H Bicyclic thiophenylamide compounds US Patent  US9604977 Publication Date 3/28/2017 
Target
Name:
Fatty acid-binding protein, adipocyte
Synonyms:
A-FABP ALBP FABP4 Fatty acid binding protein adipocyte Fatty acid-binding protein 4 (FABP4)
Type:
Enzyme
Mol. Mass.:
14719.23
Organism:
Homo sapiens (Human)
Description:
P15090
Residue:
132
  
Inhibitor
Name:
BDBM312376
Synonyms:
3-[3-(3-Methyl-[1,2,4]oxadiazol-5-yl)-5,6,7,8-tetrahydro-4H-cyclohepta[b]thiophen-2-ylcarbamoyl]-bicyclo[2.2.2]oct-2-ene-2-carboxylic acid | US9604977, Example 122
Type:
Small organic molecule
Emp. Form.:
C22H25N3O4S
Mol. Mass.:
427.517
SMILES:
Cc1noc(n1)-c1c(NC(=O)C2=C(C3CCC2CC3)C(O)=O)sc2CCCCCc12
: