Target
Fatty acid-binding protein, adipocyte
Ligand
BDBM312383
Substrate
Meas. Tech.
Time Resolved-Fluorescence Energy Transfer (TR-FRET) Assay
IC50
20.0±n/a nM
Citation
 Buettelmann, BCeccarelli, SMKuehne, HKuhn, BNeidhart, WObst Sander, URichter, H Bicyclic thiophenylamide compounds US Patent  US9604977 Publication Date 3/28/2017 
Target
Name:
Fatty acid-binding protein, adipocyte
Synonyms:
A-FABP ALBP FABP4 Fatty acid binding protein adipocyte Fatty acid-binding protein 4 (FABP4)
Type:
Enzyme
Mol. Mass.:
14719.23
Organism:
Homo sapiens (Human)
Description:
P15090
Residue:
132
  
Inhibitor
Name:
BDBM312383
Synonyms:
2-[3-(3-Methyl-[1,2,4]oxadiazol-5-yl)-5,6-dihydro-4H-cyclopenta[b]thiophen-2-yl-carbamoyl]-cyclopent-1-enecarboxylic acid | US9604977, Example 129
Type:
Small organic molecule
Emp. Form.:
C17H17N3O4S
Mol. Mass.:
359.4
SMILES:
Cc1noc(n1)-c1c(NC(=O)C2=C(CCC2)C(O)=O)sc2CCCc12
: