Target
Fatty acid-binding protein, adipocyte
Ligand
BDBM312511
Substrate
Meas. Tech.
Time Resolved-Fluorescence Energy Transfer (TR-FRET) Assay
IC50
34.0±n/a nM
Citation
 Buettelmann, BCeccarelli, SMKuehne, HKuhn, BNeidhart, WObst Sander, URichter, H Bicyclic thiophenylamide compounds US Patent  US9604977 Publication Date 3/28/2017 
Target
Name:
Fatty acid-binding protein, adipocyte
Synonyms:
A-FABP ALBP FABP4 Fatty acid binding protein adipocyte Fatty acid-binding protein 4 (FABP4)
Type:
Enzyme
Mol. Mass.:
14719.23
Organism:
Homo sapiens (Human)
Description:
P15090
Residue:
132
  
Inhibitor
Name:
BDBM312511
Synonyms:
(R)-1-[[3-[3-(trifluoromethyl)-1,2,4-oxadiazol-5-yl]-4,5,6,7-tetrahydrobenzothiophen-2-yl]carbamoyl]pyrrolidine-2-carboxylic acid | US9604977, Example 257
Type:
Small organic molecule
Emp. Form.:
C17H17F3N4O4S
Mol. Mass.:
430.401
SMILES:
OC(=O)[C@H]1CCCN1C(=O)Nc1sc2CCCCc2c1-c1nc(no1)C(F)(F)F
: