Target
Prostaglandin E2 receptor EP2 subtype
Ligand
BDBM180007
Substrate
Meas. Tech.
Binding Assay
pH
6±n/a
Ki
4.40±n/a nM
Comments
extracted
Citation
 Shibakawa, NYoneda, KKatsube, TKanda, TIto, KYamamoto, KIwase, NUshiyama, S Substituted biaryl compound US Patent  US9676720 Publication Date 6/13/2017 
Target
Name:
Prostaglandin E2 receptor EP2 subtype
Synonyms:
PE2R2_HUMAN PTGER2 Prostaglandin E2 receptor Prostanoid EP2 Receptor
Type:
Enzyme
Mol. Mass.:
39775.71
Organism:
Homo sapiens (Human)
Description:
P43116
Residue:
358
  
Inhibitor
Name:
BDBM180007
Synonyms:
US9676720, Comparative example 3
Type:
Small organic molecule
Emp. Form.:
C26H23FN4O4S
Mol. Mass.:
506.549
SMILES:
OC(=O)CNc1cccc(CN(Cc2ccc(cc2)-c2ccc(F)cc2)S(=O)(=O)c2cccnc2)n1
: