Target
Aromatase
Ligand
BDBM10061
Substrate
BDBM8592
Meas. Tech.
Aromatase Assay
IC50
1000±n/a nM
Citation
 Lesuisse, DGourvest, JFBenslimane, OCanu, FDelaisi, CDoucet, BHartmann, CLefrancois, JMTric, BMansuy, DPhilibert, DTeutsch, G Structure-activity relationships of a new family of steroidal aromatase inhibitors. 1. Synthesis and evaluation of a series of analogs related to 19-[(methylthio)methyl]androstenedione (RU54115). J Med Chem 39:757-72 (1996)  
Target
Name:
Aromatase
Synonyms:
ARO1 CP19A_HUMAN CYP19 CYPXIX Cytochrome P450 19A1 Cytochrome P450-C19 (CYP19) FL cytokine receptor precursor | P-450AROM
Type:
Enzyme
Mol. Mass.:
57888.92
Organism:
Homo sapiens (Human)
Description:
P11511
Residue:
503
  
Inhibitor
Name:
BDBM10061
Synonyms:
(2R,15S)-15-methyl-2-[2-(prop-2-yn-1-ylsulfanyl)ethyl]tetracyclo[8.7.0.0^{2,7}.0^{11,15}]heptadeca-1(17),6-diene-5,14-dione RU54115 Analog 22
Type:
Small organic molecule
Emp. Form.:
C23H28O2S
Mol. Mass.:
368.532
SMILES:
C[C@]12CC=C3C(CCC4=CC(=O)CC[C@]34CCSCC#C)C1CCC2=O
:
Substrate
Name:
BDBM8592
Synonyms:
(2R,15S)-2,15-dimethyltetracyclo[8.7.0.0^{2,7}.0^{11,15}]heptadec-6-ene-5,14-dione Androst-4-ene-3,17-dione [1beta-3H] androstenedione
Type:
Small organic molecule
Emp. Form.:
C19H26O2
Mol. Mass.:
286.4085
SMILES:
C[C@]12CCC3C(CCC4=CC(=O)CC[C@]34C)C1CCC2=O
: