Target
Caspase-6
Ligand
BDBM10280
Substrate
Caspase Substrate
Meas. Tech.
Caspase Inhibition Assay
IC50
201±n/a nM
Citation
 Chen, YHZhang, YHZhang, HJLiu, DZGu, MLi, JYWu, FZhu, XZLi, JNan, FJ Design, synthesis, and biological evaluation of isoquinoline-1,3,4-trione derivatives as potent caspase-3 inhibitors. J Med Chem 49:1613-23 (2006)  
Target
Name:
Caspase-6
Synonyms:
Apoptotic protease Mch-2 CASP6 Caspase | MCH2
Type:
Enzyme
Mol. Mass.:
33312.62
Organism:
Homo sapiens (Human)
Description:
P55212
Residue:
293
  
Inhibitor
Name:
BDBM10280
Synonyms:
3-[(1,3,4-trioxo-1,2,3,4-tetrahydroisoquinolin-6-yl)carbamoyl]propanoic acid N-(1,3,4-Trioxo-1,2,3,4-tetrahydro-isoquinolin-6-yl)-succinamic acid
Type:
Small organic molecule
Emp. Form.:
C13H10N2O6
Mol. Mass.:
290.2283
SMILES:
OC(=O)CCC(=O)Nc1ccc2C(=O)NC(=O)C(=O)c2c1
:
Substrate
Name:
Caspase Substrate
Synonyms:
Type:
Mol. Mass.:
358.43
Organism:
Description:
Residue:
3
NA