Target
Caspase-6
Ligand
BDBM10318
Substrate
Caspase Fluorogenic Substrate
Meas. Tech.
Caspase Inhibition Assay
Ki
29000±n/a nM
Citation
 Lee, DLong, SAMurray, JHAdams, JLNuttall, MENadeau, DPKikly, KWinkler, JDSung, CMRyan, MDLevy, MAKeller, PMDeWolf, WE Potent and selective nonpeptide inhibitors of caspases 3 and 7. J Med Chem 44:2015-26 (2001)  
Target
Name:
Caspase-6
Synonyms:
Apoptotic protease Mch-2 CASP6 Caspase | MCH2
Type:
Enzyme
Mol. Mass.:
33312.62
Organism:
Homo sapiens (Human)
Description:
P55212
Residue:
293
  
Inhibitor
Name:
BDBM10318
Synonyms:
(S)-5-{1-[2-(Phenoxymethyl)pyrrolidinyl]sulfonyl}isatin CHEMBL62993 Pyrrolidine Isatin Analogue 10
Type:
Small organic molecule
Emp. Form.:
C19H18N2O5S
Mol. Mass.:
386.422
SMILES:
O=C1Nc2ccc(cc2C1=O)S(=O)(=O)N1CCC[C@H]1COc1ccccc1
:
Substrate
Name:
Caspase Fluorogenic Substrate
Synonyms:
Ac-DEVD-AMC | Caspase Fluorogenic Substrate
Type:
Peptide
Mol. Mass.:
1461.77
Organism:
Description:
AMC=7-Amino-4-methylcoumarin
Residue:
16
ACASPGLVALASPAMC