Target
Caspase-7
Ligand
BDBM10309
Substrate
Caspase Fluorogenic Substrate
Meas. Tech.
Caspase Inhibition Assay
Ki
3000±n/a nM
Citation
 Lee, DLong, SAMurray, JHAdams, JLNuttall, MENadeau, DPKikly, KWinkler, JDSung, CMRyan, MDLevy, MAKeller, PMDeWolf, WE Potent and selective nonpeptide inhibitors of caspases 3 and 7. J Med Chem 44:2015-26 (2001)  
Target
Name:
Caspase-7
Synonyms:
Apoptotic protease Mch-3 CASP7 CMH-1 MCH3 | caspase 7, apoptosis-related cysteine peptidase
Type:
Enzyme
Mol. Mass.:
34273.91
Organism:
Homo sapiens (Human)
Description:
P55210
Residue:
303
  
Inhibitor
Name:
BDBM10309
Synonyms:
5-(pyrrolidine-1-sulfonyl)-2,3-dihydro-1H-indole-2,3-dione Isatin Sulfonamide 20
Type:
Small organic molecule
Emp. Form.:
C12H12N2O4S
Mol. Mass.:
280.3
SMILES:
O=C1Nc2ccc(cc2C1=O)S(=O)(=O)N1CCCC1
:
Substrate
Name:
Caspase Fluorogenic Substrate
Synonyms:
Ac-DEVD-AMC | Caspase Fluorogenic Substrate
Type:
Peptide
Mol. Mass.:
1461.77
Organism:
Description:
AMC=7-Amino-4-methylcoumarin
Residue:
16
ACASPGLVALASPAMC