Target
Caspase-8
Ligand
BDBM10315
Substrate
Caspase-8 Fluorogenic Substrate
Meas. Tech.
Caspase Inhibition Assay
Ki
80000±n/a nM
Citation
 Lee, DLong, SAMurray, JHAdams, JLNuttall, MENadeau, DPKikly, KWinkler, JDSung, CMRyan, MDLevy, MAKeller, PMDeWolf, WE Potent and selective nonpeptide inhibitors of caspases 3 and 7. J Med Chem 44:2015-26 (2001)  
Target
Name:
Caspase-8
Synonyms:
Apoptotic cysteine protease CAP4 CASP8 Caspase Caspase-8 subunit p18 FADD-like ICE ICE-like apoptotic protease 5 MCH5 | MORT1-associated CED-3 homolog
Type:
Enzyme
Mol. Mass.:
55373.89
Organism:
Homo sapiens (Human)
Description:
Q14790
Residue:
479
  
Inhibitor
Name:
BDBM10315
Synonyms:
(S)-5-{1-[2-(Anilinomethyl)pyrrolidinyl]sulfonyl}isatin Isatin Sulfonamide 26
Type:
Small organic molecule
Emp. Form.:
C19H19N3O4S
Mol. Mass.:
385.437
SMILES:
O=C1Nc2ccc(cc2C1=O)S(=O)(=O)N1CCC[C@H]1CNc1ccccc1
:
Substrate
Name:
Caspase-8 Fluorogenic Substrate
Synonyms:
Ac-IETD-AMC
Type:
Peptide
Mol. Mass.:
1673.49
Organism:
Description:
AMC=7-Amino-4-methylcoumarin
Residue:
16
ACILEGLTHRASPAMC