Target
High affinity nerve growth factor receptor
Ligand
BDBM164887
Substrate
Meas. Tech.
In Vitro TrkA Activity
IC50
8.00±n/a nM
Citation
 Kane, Jr., JLMatthews, GMetz, MKothe, MLiu, JScholte, A Tropomyosin-related kinase (Trk) inhibitors US Patent  US10166239 Publication Date 1/1/2019 
Target
Name:
High affinity nerve growth factor receptor
Synonyms:
2.7.10.1 NTRK1 NTRK1_HUMAN Neurotrophic tyrosine kinase receptor type 1 Synonyms=MTC TRK1-transforming tyrosine kinase protein TRKA GN Tropomyosin alpha-3 chain/High affinity nerve growth factor receptor Tropomyosin-related kinase A (TrkA) Tyrosine kinase receptor (Trk) Tyrosine kinase receptor A (Trk A) Tyrosine kinase receptor A (TrkA) p140-TrkA
Type:
Mol. Mass.:
87498.18
Organism:
Homo sapiens (Human)
Description:
P04629
Residue:
796
  
Inhibitor
Name:
BDBM164887
Synonyms:
US10166239, Ex. 3-2-2 US9067914, Ex. 3-2-2
Type:
Small organic molecule
Emp. Form.:
C28H26N4O3
Mol. Mass.:
466.531
SMILES:
COc1ccc(COc2ccc(Cn3c(N)nc4cc(ccc34)-c3ccncc3)cc2OC)cc1
: