Target
High affinity nerve growth factor receptor
Ligand
BDBM164947
Substrate
Meas. Tech.
In Vitro TrkA Activity
IC50
7.00±n/a nM
Citation
 Kane, Jr., JLMatthews, GMetz, MKothe, MLiu, JScholte, A Tropomyosin-related kinase (Trk) inhibitors US Patent  US10166239 Publication Date 1/1/2019 
Target
Name:
High affinity nerve growth factor receptor
Synonyms:
2.7.10.1 NTRK1 NTRK1_HUMAN Neurotrophic tyrosine kinase receptor type 1 Synonyms=MTC TRK1-transforming tyrosine kinase protein TRKA GN Tropomyosin alpha-3 chain/High affinity nerve growth factor receptor Tropomyosin-related kinase A (TrkA) Tyrosine kinase receptor (Trk) Tyrosine kinase receptor A (Trk A) Tyrosine kinase receptor A (TrkA) p140-TrkA
Type:
Mol. Mass.:
87498.18
Organism:
Homo sapiens (Human)
Description:
P04629
Residue:
796
  
Inhibitor
Name:
BDBM164947
Synonyms:
US10166239, Ex. 3-42 US9067914, Ex. 3-42
Type:
Small organic molecule
Emp. Form.:
C25H25N5O4
Mol. Mass.:
459.4971
SMILES:
COc1ccc(COc2ccc(Cn3c(N)nc4cc(cnc34)C#CCCO)cc2OC)cn1
: