Target
Caspase-3
Ligand
BDBM10344
Substrate
Caspase Fluorogenic Substrate
Meas. Tech.
Caspase Inhibition Assay
IC50
9.4±n/a nM
Citation
 Chu, WZhang, JZeng, CRothfuss, JTu, ZChu, YReichert, DEWelch, MJMach, RH N-benzylisatin sulfonamide analogues as potent caspase-3 inhibitors: synthesis, in vitro activity, and molecular modeling studies. J Med Chem 48:7637-47 (2005)  
Target
Name:
Caspase-3
Synonyms:
Apopain CASP3 CPP-32 Caspase 3 Caspase-3 subunit p17 SCA-1 Yama protein | caspase-3 preproprotein
Type:
Hydrolase; heterotetramer of two heterodimers
Mol. Mass.:
31607.55
Organism:
Homo sapiens (Human)
Description:
Residue:
277
  
Inhibitor
Name:
BDBM10344
Synonyms:
(S)-1-(2-Fluorobenzyl)-5-(2-phenoxymethyl-azetidine-1-sulfonyl)-1H-indole-2,3-dione Azetidine Isatin Analogue 18f
Type:
Small organic molecule
Emp. Form.:
C25H21FN2O5S
Mol. Mass.:
480.508
SMILES:
Fc1ccccc1CN1C(=O)C(=O)c2cc(ccc12)S(=O)(=O)N1CC[C@H]1COc1ccccc1
:
Substrate
Name:
Caspase Fluorogenic Substrate
Synonyms:
Ac-DEVD-AMC | Caspase Fluorogenic Substrate
Type:
Peptide
Mol. Mass.:
1461.77
Organism:
Description:
AMC=7-Amino-4-methylcoumarin
Residue:
16
ACASPGLVALASPAMC