Target
Caspase-3
Ligand
BDBM10346
Substrate
Caspase Fluorogenic Substrate
Meas. Tech.
Caspase Inhibition Assay
IC50
29.2±n/a nM
Citation
 Chu, WZhang, JZeng, CRothfuss, JTu, ZChu, YReichert, DEWelch, MJMach, RH N-benzylisatin sulfonamide analogues as potent caspase-3 inhibitors: synthesis, in vitro activity, and molecular modeling studies. J Med Chem 48:7637-47 (2005)  
Target
Name:
Caspase-3
Synonyms:
Apopain CASP3 CPP-32 Caspase 3 Caspase-3 subunit p17 SCA-1 Yama protein | caspase-3 preproprotein
Type:
Hydrolase; heterotetramer of two heterodimers
Mol. Mass.:
31607.55
Organism:
Homo sapiens (Human)
Description:
Residue:
277
  
Inhibitor
Name:
BDBM10346
Synonyms:
(S)-1-(2-Fluoropyridin-4-yl-methyl)-5-(2-phenoxymethyl-azetidine1-sulfonyl)-1H-indole-2,3-dione Azetidine Isatin Analogue 18h
Type:
Small organic molecule
Emp. Form.:
C24H20FN3O5S
Mol. Mass.:
481.496
SMILES:
Fc1cc(CN2C(=O)C(=O)c3cc(ccc23)S(=O)(=O)N2CC[C@H]2COc2ccccc2)ccn1
:
Substrate
Name:
Caspase Fluorogenic Substrate
Synonyms:
Ac-DEVD-AMC | Caspase Fluorogenic Substrate
Type:
Peptide
Mol. Mass.:
1461.77
Organism:
Description:
AMC=7-Amino-4-methylcoumarin
Residue:
16
ACASPGLVALASPAMC