Target
Caspase-8
Ligand
BDBM10342
Substrate
Caspase-8 Fluorogenic Substrate
Meas. Tech.
Caspase Inhibition Assay
IC50
>50000±n/a nM
Citation
 Chu, WZhang, JZeng, CRothfuss, JTu, ZChu, YReichert, DEWelch, MJMach, RH N-benzylisatin sulfonamide analogues as potent caspase-3 inhibitors: synthesis, in vitro activity, and molecular modeling studies. J Med Chem 48:7637-47 (2005)  
Target
Name:
Caspase-8
Synonyms:
Apoptotic cysteine protease CAP4 CASP8 Caspase Caspase-8 subunit p18 FADD-like ICE ICE-like apoptotic protease 5 MCH5 | MORT1-associated CED-3 homolog
Type:
Enzyme
Mol. Mass.:
55373.89
Organism:
Homo sapiens (Human)
Description:
Q14790
Residue:
479
  
Inhibitor
Name:
BDBM10342
Synonyms:
(S)-1-(4-Methylthiobenzyl)-5-(2-phenoxymethyl-azetidine-1-sulfonyl)-1H-indole-2,3-dione Azetidine Isatin Analogue 18d
Type:
Small organic molecule
Emp. Form.:
C26H24N2O5S2
Mol. Mass.:
508.609
SMILES:
CSc1ccc(CN2C(=O)C(=O)c3cc(ccc23)S(=O)(=O)N2CC[C@H]2COc2ccccc2)cc1
:
Substrate
Name:
Caspase-8 Fluorogenic Substrate
Synonyms:
Ac-IETD-AMC
Type:
Peptide
Mol. Mass.:
1673.49
Organism:
Description:
AMC=7-Amino-4-methylcoumarin
Residue:
16
ACILEGLTHRASPAMC