Target
Prokineticin receptor 1
Ligand
BDBM250617
Substrate
Meas. Tech.
BIOLOGICAL ASSAY
IC50
80.0±n/a nM
Citation
 Carroll, CGoldby, ATeall, M Sulfonyl piperidine derivatives and their use for treating prokineticin mediated diseases US Patent  US10167273 Publication Date 1/1/2019 
Target
Name:
Prokineticin receptor 1
Synonyms:
G-protein coupled receptor 73 GPR73 PK-R1 PKR1_HUMAN | PROKR1
Type:
enzyme
Mol. Mass.:
44779.92
Organism:
Homo sapiens (Human)
Description:
Q8TCW9
Residue:
393
  
Inhibitor
Name:
BDBM250617
Synonyms:
US10167273, Example 98 US11512066, Example 98 US9475795, 97 | US9475795, 98
Type:
Small organic molecule
Emp. Form.:
C18H24ClN3O3S
Mol. Mass.:
397.919
SMILES:
COC(C1CCN(CC1)S(=O)(=O)c1c(C)n[nH]c1C)c1ccc(Cl)cc1
: