Target
Cholinesterase
Ligand
BDBM10510
Substrate
BDBM8978
Meas. Tech.
Enzyme Inhibition Assay
pH
8±n/a
Temperature
310.15±n/a K
IC50
3.24±0.29 nM
Citation
 Rosini, MAndrisano, VBartolini, MBolognesi, MLHrelia, PMinarini, ATarozzi, AMelchiorre, C Rational approach to discover multipotent anti-Alzheimer drugs. J Med Chem 48:360-3 (2005)  
Target
Name:
Cholinesterase
Synonyms:
Acylcholine acylhydrolase Butyrylcholine esterase (BChE) Butyrylcholinesterase (BuChE) CHLE_HUMAN Cholinesterases Pseudocholinesterase
Type:
Homotetramer
Mol. Mass.:
68422.27
Organism:
Homo sapiens (Human)
Description:
P06276
Residue:
602
  
Inhibitor
Name:
BDBM10510
Synonyms:
5-(1,2-dithiolan-3-yl)-N-[6-(1,2,3,4-tetrahydroacridin-9-ylamino)hexyl]pentanamide | tacrine-lipoic acid hybrid 5
Type:
Small organic molecule
Emp. Form.:
C27H39N3OS2
Mol. Mass.:
485.748
SMILES:
O=C(CCCCC1CCSS1)NCCCCCCNc1c2CCCCc2nc2ccccc12
:
Substrate
Name:
BDBM8978
Synonyms:
(Propylcarbonylthioethyl)trimethylammonium iodide CHEMBL148530 butyrylthiocholine | butyrylthiocholine chloride
Type:
Small organic molecule
Emp. Form.:
C9H20NOS
Mol. Mass.:
190.326
SMILES:
CCCC(=O)SCC[N+](C)(C)C
: