Target
Acetylcholinesterase
Ligand
BDBM8963
Substrate
BDBM8959
Meas. Tech.
Measurement of FBSAChE/EqBuChE Inhibitory Activity
pH
8±n/a
Temperature
298.15±n/a K
Ki
1.3±n/a nM
Citation
 Savini, LCampiani, GGaeta, APellerano, CFattorusso, CChiasserini, LFedorko, JMSaxena, A Novel and potent tacrine-related hetero- and homobivalent ligands for acetylcholinesterase and butyrylcholinesterase. Bioorg Med Chem Lett 11:1779-82 (2001)  
Target
Name:
Acetylcholinesterase
Synonyms:
ACES_HUMAN Acetylcholinesterase (AChE) | Acetylcholinesterase (human AChE)
Type:
Enzyme
Mol. Mass.:
67792.70
Organism:
Homo sapiens (Human)
Description:
P22303
Residue:
614
  
Inhibitor
Name:
BDBM8963
Synonyms:
CHEMBL32823 N-[7-(1,2,3,4-tetrahydroacridin-9-ylamino)heptyl]-1,2,3,4-tetrahydroacridin-9-amine Tacrine-Based Inhibitor 2f | tacrine homobivalent compound 3a
Type:
Small organic molecule
Emp. Form.:
C33H40N4
Mol. Mass.:
492.6975
SMILES:
C(CCCNc1c2CCCCc2nc2ccccc12)CCCNc1c2CCCCc2nc2ccccc12
:
Substrate
Name:
BDBM8959
Synonyms:
(2-Mercaptoethyl)trimethylammonium iodide acetate Acetylthiocholine acetylthiocholine chloride | acetylthiocholine iodide
Type:
Small organic molecule
Emp. Form.:
C7H16NOS
Mol. Mass.:
162.272
SMILES:
CC(=O)SCC[N+](C)(C)C
: