Target
Carboxylic ester hydrolase
Ligand
BDBM10525
Substrate
BDBM8978
Meas. Tech.
Measurement of FBSAChE/EqBuChE Inhibitory Activity
pH
8±n/a
Temperature
298.15±n/a K
Ki
30±n/a nM
Citation
 Savini, LCampiani, GGaeta, APellerano, CFattorusso, CChiasserini, LFedorko, JMSaxena, A Novel and potent tacrine-related hetero- and homobivalent ligands for acetylcholinesterase and butyrylcholinesterase. Bioorg Med Chem Lett 11:1779-82 (2001)  
Target
Name:
Carboxylic ester hydrolase
Synonyms:
BuChE Butyrylcholine esterase Butyrylcholinesterase (BChE) Butyrylcholinesterase (EqBuChE) butyrylcholinesterase precursor
Type:
Protein
Mol. Mass.:
68842.83
Organism:
Equus caballus (Horse)
Description:
Q9N1N9
Residue:
602
  
Inhibitor
Name:
BDBM10525
Synonyms:
N-[6-(1,2,3,4-tetrahydroacridin-9-ylsulfanyl)hexyl]-1,2,3,4-tetrahydroacridin-9-amine | tacrine heterobivalent compound 3i
Type:
Small organic molecule
Emp. Form.:
C32H37N3S
Mol. Mass.:
495.721
SMILES:
C(CCCSc1c2CCCCc2nc2ccccc12)CCNc1c2CCCCc2nc2ccccc12
:
Substrate
Name:
BDBM8978
Synonyms:
(Propylcarbonylthioethyl)trimethylammonium iodide CHEMBL148530 butyrylthiocholine | butyrylthiocholine chloride
Type:
Small organic molecule
Emp. Form.:
C9H20NOS
Mol. Mass.:
190.326
SMILES:
CCCC(=O)SCC[N+](C)(C)C
: