Target
MAP kinase-interacting serine/threonine-protein kinase 1
Ligand
BDBM168208
Substrate
Meas. Tech.
Mnk Biochemical Enzymatic Assay
Temperature
298.15±n/a K
IC50
<10.00±n/a nM
Comments
extracted
Citation
 Reich, SHSprengeler, PAWebber, SEXiang, AXErnst, JT MNK inhibitors and methods related thereto US Patent  US9669031 Publication Date 6/6/2017 
Target
Name:
MAP kinase-interacting serine/threonine-protein kinase 1
Synonyms:
MAP Kinase-Interacting Protein Kinase (MNK1) MAP kinase-interacting serine/threonine-protein kinase 1 (MnK1) MAP-kinase interacting kinase 1 (MNK1) MKNK1 MNK1
Type:
Serine/threonine-protein kinase
Mol. Mass.:
51342.85
Organism:
Homo sapiens (Human)
Description:
Q9BUB5
Residue:
465
  
Inhibitor
Name:
BDBM168208
Synonyms:
US9669031, 39 8′-chloro-6′-(pyrimidin-4-ylamino)-2′H-spiro[cyclopentane-1,3′-imidazo[1,5-a]pyridine]-1′,5′-dione (Cpd. No. 39)
Type:
Small organic molecule
Emp. Form.:
C15H14ClN5O2
Mol. Mass.:
331.757
SMILES:
Clc1cc(Nc2ccncn2)c(=O)n2c1C(=O)NC21CCCC1
: