Target
MAP kinase-interacting serine/threonine-protein kinase 1
Ligand
BDBM168269
Substrate
Meas. Tech.
Mnk Biochemical Enzymatic Assay
Temperature
298.15±n/a K
IC50
<10.00±n/a nM
Comments
extracted
Citation
 Reich, SHSprengeler, PAWebber, SEXiang, AXErnst, JT MNK inhibitors and methods related thereto US Patent  US9669031 Publication Date 6/6/2017 
Target
Name:
MAP kinase-interacting serine/threonine-protein kinase 1
Synonyms:
MAP Kinase-Interacting Protein Kinase (MNK1) MAP kinase-interacting serine/threonine-protein kinase 1 (MnK1) MAP-kinase interacting kinase 1 (MNK1) MKNK1 MNK1
Type:
Serine/threonine-protein kinase
Mol. Mass.:
51342.85
Organism:
Homo sapiens (Human)
Description:
Q9BUB5
Residue:
465
  
Inhibitor
Name:
BDBM168269
Synonyms:
US9669031, 97 N-(6-((8-chloro-3-methyl-1,5-dioxo-3-phenyl-1,2,3,5-tetrahydroimidazo[1,5-a]pyridin-6-yl)amino)pyrimidin-4-yl)cyclopropanecarboxamide (Cpd. No. 97)
Type:
Small organic molecule
Emp. Form.:
C22H19ClN6O3
Mol. Mass.:
450.878
SMILES:
CC1(NC(=O)c2c(Cl)cc(Nc3cc(NC(=O)C4CC4)ncn3)c(=O)n12)c1ccccc1
: