Target
Cholinesterase
Ligand
BDBM10585
Substrate
BDBM8978
Meas. Tech.
Enzyme Inhibition Assay
IC50
4.74±n/a nM
Citation
 Camps, PFormosa, XMunoz-Torrero, DPetrignet, JBadia, AClos, MV Synthesis and pharmacological evaluation of huprine-tacrine heterodimers: subnanomolar dual binding site acetylcholinesterase inhibitors. J Med Chem 48:1701-4 (2005)  
Target
Name:
Cholinesterase
Synonyms:
Acylcholine acylhydrolase Butyrylcholine esterase (BChE) Butyrylcholinesterase (BuChE) CHLE_HUMAN Cholinesterases Pseudocholinesterase
Type:
Homotetramer
Mol. Mass.:
68422.27
Organism:
Homo sapiens (Human)
Description:
P06276
Residue:
602
  
Inhibitor
Name:
BDBM10585
Synonyms:
3-Chloro-6,7,10,11-tetrahydro-9-methyl-12-{{8-[(1,2,3,4-tetrahydroacridin-9-yl)amino]octyl}amino}-7,11-methanocycloocta[b]quinoline dihydrochloride CHEMBL2011488 | Huprine-Tacrine Heterodimer 17c
Type:
Small organic molecule
Emp. Form.:
C38H45ClN4
Mol. Mass.:
593.244
SMILES:
CC1=CC2CC(C1)c1c(C2)nc2cc(Cl)ccc2c1NCCCCCCCCNc1c2CCCCc2nc2ccccc12
:
Substrate
Name:
BDBM8978
Synonyms:
(Propylcarbonylthioethyl)trimethylammonium iodide CHEMBL148530 butyrylthiocholine | butyrylthiocholine chloride
Type:
Small organic molecule
Emp. Form.:
C9H20NOS
Mol. Mass.:
190.326
SMILES:
CCCC(=O)SCC[N+](C)(C)C
: