Target
Acetylcholinesterase
Ligand
BDBM10605
Substrate
BDBM8959
Meas. Tech.
Cholinesterase Inhibition Assay
pH
8±n/a
Temperature
310.15±n/a K
IC50
38±1 nM
Citation
 Luo, WYu, QSKulkarni, SSParrish, DAHolloway, HWTweedie, DShafferman, ALahiri, DKBrossi, AGreig, NH Inhibition of human acetyl- and butyrylcholinesterase by novel carbamates of (-)- and (+)-tetrahydrofurobenzofuran and methanobenzodioxepine. J Med Chem 49:2174-85 (2006)  
Target
Name:
Acetylcholinesterase
Synonyms:
ACES_HUMAN Acetylcholinesterase (AChE) | Acetylcholinesterase (human AChE)
Type:
Enzyme
Mol. Mass.:
67792.70
Organism:
Homo sapiens (Human)
Description:
P22303
Residue:
614
  
Inhibitor
Name:
BDBM10605
Synonyms:
(+)-(5S)-5-Methyl-4,5-dihydro-2,5-methano-1,3-benzodioxepin-7-yl N-(o-Tolyl)-carbamate Benzodioxepine Carbamate 12a
Type:
Emp. Form.:
C19H19NO4
Mol. Mass.:
325.3585
SMILES:
Cc1ccccc1NC(=O)Oc1ccc2OC3C[C@](C)(CO3)c2c1
:
Substrate
Name:
BDBM8959
Synonyms:
(2-Mercaptoethyl)trimethylammonium iodide acetate Acetylthiocholine acetylthiocholine chloride | acetylthiocholine iodide
Type:
Small organic molecule
Emp. Form.:
C7H16NOS
Mol. Mass.:
162.272
SMILES:
CC(=O)SCC[N+](C)(C)C
: