Target
Acetylcholinesterase
Ligand
BDBM10611
Substrate
BDBM8959
Meas. Tech.
Cholinesterase Inhibition Assay
pH
8±n/a
Temperature
310.15±n/a K
IC50
10±2 nM
Citation
 Luo, WYu, QSKulkarni, SSParrish, DAHolloway, HWTweedie, DShafferman, ALahiri, DKBrossi, AGreig, NH Inhibition of human acetyl- and butyrylcholinesterase by novel carbamates of (-)- and (+)-tetrahydrofurobenzofuran and methanobenzodioxepine. J Med Chem 49:2174-85 (2006)  
Target
Name:
Acetylcholinesterase
Synonyms:
ACES_HUMAN Acetylcholinesterase (AChE) | Acetylcholinesterase (human AChE)
Type:
Enzyme
Mol. Mass.:
67792.70
Organism:
Homo sapiens (Human)
Description:
P22303
Residue:
614
  
Inhibitor
Name:
BDBM10611
Synonyms:
(3aS)-1,3a,8-trimethyl-1H,2H,3H,3aH,8H,8aH-pyrrolo[2,3-b]indol-5-yl N-(2-methylphenyl)carbamate Physostigmine Carbamate 17a
Type:
Small organic molecule
Emp. Form.:
C21H25N3O2
Mol. Mass.:
351.4421
SMILES:
CN1CC[C@]2(C)C1N(C)c1ccc(OC(=O)Nc3ccccc3C)cc21
:
Substrate
Name:
BDBM8959
Synonyms:
(2-Mercaptoethyl)trimethylammonium iodide acetate Acetylthiocholine acetylthiocholine chloride | acetylthiocholine iodide
Type:
Small organic molecule
Emp. Form.:
C7H16NOS
Mol. Mass.:
162.272
SMILES:
CC(=O)SCC[N+](C)(C)C
: