Target
Acetylcholinesterase
Ligand
BDBM10615
Substrate
BDBM8959
Meas. Tech.
Cholinesterase Inhibition Assay
IC50
56±n/a nM
Citation
 Luo, WYu, QSKulkarni, SSParrish, DAHolloway, HWTweedie, DShafferman, ALahiri, DKBrossi, AGreig, NH Inhibition of human acetyl- and butyrylcholinesterase by novel carbamates of (-)- and (+)-tetrahydrofurobenzofuran and methanobenzodioxepine. J Med Chem 49:2174-85 (2006)  
Target
Name:
Acetylcholinesterase
Synonyms:
ACES_HUMAN Acetylcholinesterase (AChE) | Acetylcholinesterase (human AChE)
Type:
Enzyme
Mol. Mass.:
67792.70
Organism:
Homo sapiens (Human)
Description:
P22303
Residue:
614
  
Inhibitor
Name:
BDBM10615
Synonyms:
(3aR)-3a,8-dimethyl-2H,3H,3aH,8H,8aH-furo[2,3-b]indol-5-yl N-methylcarbamate | Physovenine Carbamate 20b
Type:
Small organic molecule
Emp. Form.:
C14H18N2O3
Mol. Mass.:
262.3043
SMILES:
CNC(=O)Oc1ccc2N(C)C3OCC[C@]3(C)c2c1
:
Substrate
Name:
BDBM8959
Synonyms:
(2-Mercaptoethyl)trimethylammonium iodide acetate Acetylthiocholine acetylthiocholine chloride | acetylthiocholine iodide
Type:
Small organic molecule
Emp. Form.:
C7H16NOS
Mol. Mass.:
162.272
SMILES:
CC(=O)SCC[N+](C)(C)C
: