Target
Cathepsin D
Ligand
BDBM171530
Substrate
Meas. Tech.
In Vitro Enzymatic FRET Assay
IC50
949930±n/a nM
Citation
 Minatti, AELow, JDAllen, JRAmegadzie, ABrown, JFrohn, MJGuzman-Perez, AHarrington, PELopez, PMa, VVNishimura, NQian, WRumfelt, SRzasa, RMSham, KSmith, ALWhite, RXue, Q Perfluorinated cyclopropyl fused 1,3-oxazin-2-amine compounds as beta-secretase inhibitors and methods of use US Patent  US9611261 Publication Date 4/4/2017 
Target
Name:
Cathepsin D
Synonyms:
CATD_HUMAN CTSD Cathepsin D heavy chain Cathepsin D precursor
Type:
Enzyme
Mol. Mass.:
44551.72
Organism:
Homo sapiens (Human)
Description:
Human proCathepsin D (SwissProt accession number P07339) was expressed in Sf9 cells, purified, and autoactivated.
Residue:
412
  
Inhibitor
Name:
BDBM171530
Synonyms:
US9085576, 164 | US9611261, Example 164
Type:
Small organic molecule
Emp. Form.:
C17H14ClF4N5O2
Mol. Mass.:
431.772
SMILES:
NC1=N[C@@](CF)([C@H]2C[C@H]2O1)c1cc(NC(=O)c2nn(cc2Cl)C(F)F)ccc1F
: