Target
Cathepsin D
Ligand
BDBM171654
Substrate
Meas. Tech.
In Vitro Enzymatic FRET Assay
IC50
1255700±n/a nM
Citation
 Minatti, AELow, JDAllen, JRAmegadzie, ABrown, JFrohn, MJGuzman-Perez, AHarrington, PELopez, PMa, VVNishimura, NQian, WRumfelt, SRzasa, RMSham, KSmith, ALWhite, RXue, Q Perfluorinated cyclopropyl fused 1,3-oxazin-2-amine compounds as beta-secretase inhibitors and methods of use US Patent  US9611261 Publication Date 4/4/2017 
Target
Name:
Cathepsin D
Synonyms:
CATD_HUMAN CTSD Cathepsin D heavy chain Cathepsin D precursor
Type:
Enzyme
Mol. Mass.:
44551.72
Organism:
Homo sapiens (Human)
Description:
Human proCathepsin D (SwissProt accession number P07339) was expressed in Sf9 cells, purified, and autoactivated.
Residue:
412
  
Inhibitor
Name:
BDBM171654
Synonyms:
US9085576, 288 | US9611261, Example 288
Type:
Small organic molecule
Emp. Form.:
C21H21F3N4O2
Mol. Mass.:
418.4122
SMILES:
CC(C)c1cccnc1C(=O)Nc1ccc(F)c(c1)[C@]1(N=C(N)O[C@@H]2C[C@H]12)C(F)F
: