Target
Caspase-3
Ligand
BDBM10246
Substrate
Caspase Fluorogenic Substrate
Meas. Tech.
Caspase Inhibition Assay
pH
7±n/a
Temperature
310.15±n/a K
IC50
43.9±n/a nM
Citation
 Becker, JWRotonda, JSoisson, SMAspiotis, RBayly, CFrancoeur, SGallant, MGarcia-Calvo, MGiroux, AGrimm, EHan, YMcKay, DNicholson, DWPeterson, ERenaud, JRoy, SThornberry, NZamboni, R Reducing the peptidyl features of caspase-3 inhibitors: a structural analysis. J Med Chem 47:2466-74 (2004)  
Target
Name:
Caspase-3
Synonyms:
Apopain CASP3 CPP-32 Caspase 3 Caspase-3 subunit p17 SCA-1 Yama protein | caspase-3 preproprotein
Type:
Hydrolase; heterotetramer of two heterodimers
Mol. Mass.:
31607.55
Organism:
Homo sapiens (Human)
Description:
Residue:
277
  
Inhibitor
Name:
BDBM10246
Synonyms:
(4S)-4-{[(1S)-1-{[(2S)-1-carboxy-3-oxopropan-2-yl]carbamoyl}-2-methylpropyl]carbamoyl}-4-[(3S)-3-acetamido-3-formamidopropanoic acid]butanoic acid CHEMBL417149
Type:
Small organic molecule
Emp. Form.:
C20H30N4O11
Mol. Mass.:
502.4724
SMILES:
CC(C)[C@H](NC(=O)[C@H](CCC(O)=O)NC(=O)[C@H](CC(O)=O)NC(C)=O)C(=O)N[C@@H](CC(O)=O)C=O
:
Substrate
Name:
Caspase Fluorogenic Substrate
Synonyms:
Ac-DEVD-AMC | Caspase Fluorogenic Substrate
Type:
Peptide
Mol. Mass.:
1461.77
Organism:
Description:
AMC=7-Amino-4-methylcoumarin
Residue:
16
ACASPGLVALASPAMC