Target
Caspase-7
Ligand
BDBM10661
Substrate
Caspase Fluorogenic Substrate
Meas. Tech.
Caspase Inhibition Assay
IC50
1400±n/a nM
Citation
 Han, YGiroux, AGrimm, ELAspiotis, RFrancoeur, SBayly, CIMckay, DJRoy, SXanthoudakis, SVaillancourt, JPRasper, DMTam, JTawa, PThornberry, NAPaterson, EPGarcia-Calvo, MBecker, JWRotonda, JNicholson, DWZamboni, RJ Discovery of novel aspartyl ketone dipeptides as potent and selective caspase-3 inhibitors. Bioorg Med Chem Lett 14:805-8 (2004)  
Target
Name:
Caspase-7
Synonyms:
Apoptotic protease Mch-3 CASP7 CMH-1 MCH3 | caspase 7, apoptosis-related cysteine peptidase
Type:
Enzyme
Mol. Mass.:
34273.91
Organism:
Homo sapiens (Human)
Description:
P55210
Residue:
303
  
Inhibitor
Name:
BDBM10661
Synonyms:
(3S)-5-(benzylsulfanyl)-3-[(2S)-2-[(5-fluoro-1H-indol-2-yl)formamido]-3-methylbutanamido]-4-oxopentanoic acid | valine aspartyl ketone analog 3
Type:
Small organic molecule
Emp. Form.:
C26H28FN3O5S
Mol. Mass.:
513.581
SMILES:
CC(C)[C@H](NC(=O)c1cc2cc(F)ccc2[nH]1)C(=O)N[C@@H](CC(O)=O)C(=O)CSCc1ccccc1
:
Substrate
Name:
Caspase Fluorogenic Substrate
Synonyms:
Ac-DEVD-AMC | Caspase Fluorogenic Substrate
Type:
Peptide
Mol. Mass.:
1461.77
Organism:
Description:
AMC=7-Amino-4-methylcoumarin
Residue:
16
ACASPGLVALASPAMC