Target
Acetylcholinesterase
Ligand
BDBM10692
Substrate
BDBM8959
Meas. Tech.
Cholinesterase Inhibition Assay
pH
8±n/a
Temperature
310.15±n/a K
IC50
0.3±0.01 nM
Citation
 Belluti, FRampa, APiazzi, LBisi, AGobbi, SBartolini, MAndrisano, VCavalli, ARecanatini, MValenti, P Cholinesterase inhibitors: xanthostigmine derivatives blocking the acetylcholinesterase-induced beta-amyloid aggregation. J Med Chem 48:4444-56 (2005)  
Target
Name:
Acetylcholinesterase
Synonyms:
ACES_HUMAN Acetylcholinesterase (AChE) | Acetylcholinesterase (human AChE)
Type:
Enzyme
Mol. Mass.:
67792.70
Organism:
Homo sapiens (Human)
Description:
P22303
Residue:
614
  
Inhibitor
Name:
BDBM10692
Synonyms:
3-{[methyl({3-[(9-oxo-9H-xanthen-3-yl)oxy]propyl})amino]methyl}phenyl N-methylcarbamate Xanthostigmine | aminoalkoxyheteroaryl deriv. 8
Type:
Small organic molecule
Emp. Form.:
C26H26N2O5
Mol. Mass.:
446.495
SMILES:
CNC(=O)Oc1cccc(CN(C)CCCOc2ccc3c(c2)oc2ccccc2c3=O)c1
:
Substrate
Name:
BDBM8959
Synonyms:
(2-Mercaptoethyl)trimethylammonium iodide acetate Acetylthiocholine acetylthiocholine chloride | acetylthiocholine iodide
Type:
Small organic molecule
Emp. Form.:
C7H16NOS
Mol. Mass.:
162.272
SMILES:
CC(=O)SCC[N+](C)(C)C
: