Target
ATP-dependent RNA helicase DHX29
Ligand
BDBM65493
Substrate
Meas. Tech.
ATPase enzyme assay
IC50
>1.00e+5±n/a nM
Citation
 Iwatani-Yoshihara, MIto, MIshibashi, YOki, HTanaka, TMorishita, DIto, TKimura, HImaeda, YAparicio, SNakanishi, AKawamoto, T Discovery and Characterization of a Eukaryotic Initiation Factor 4A-3-Selective Inhibitor That Suppresses Nonsense-Mediated mRNA Decay. ACS Chem Biol 12:1760-1768 (2017)  
Target
Name:
ATP-dependent RNA helicase DHX29
Synonyms:
DDX29 DHX29 Nucleic acid helicase DDXx
Type:
Protein
Mol. Mass.:
155255.95
Organism:
Homo sapiens (Human)
Description:
Q7Z478
Residue:
1369
  
Inhibitor
Name:
BDBM65493
Synonyms:
eIF4A3 inhibitor, 2
Type:
Small organic molecule
Emp. Form.:
C25H19Br2ClN4O2
Mol. Mass.:
602.705
SMILES:
Clc1ccc(cc1)[C@H]1CN(CCN1C(=O)c1ccc(Br)cc1)C(=O)c1cnn2cc(Br)ccc12
: