Target
Proto-oncogene tyrosine-protein kinase receptor Ret [G810R]
Ligand
BDBM305552
Substrate
Meas. Tech.
RET G810R Mutant Assay
IC50
40.0±n/a nM
Citation
 Andrews, SWAronow, SBlake, JFBrandhuber, BJCollier, JCook, AHaas, JJiang, YKolakowski, GRMcFaddin, EAMcKenney, MLMcNulty, OTMetcalf, ATMoreno, DARamann, GATang, TPRen, LWalls, SM Substituted pyrazolo[1,5-A]pyridine compounds as RET kinase inhibitors US Patent  US10172845 Publication Date 1/8/2019 
Target
Name:
Proto-oncogene tyrosine-protein kinase receptor Ret [G810R]
Synonyms:
CDHF12 PTC RET RET kinase mutant (G810R) RET_HUMAN | ret enzyme (g810r)
Type:
Enzyme Catalytic Domain
Mol. Mass.:
124418.43
Organism:
Homo sapiens (Human)
Description:
P07949[G810R]
Residue:
1114
  
Inhibitor
Name:
BDBM305552
Synonyms:
US10144734, Example 569 US10441581, Example 569 US11648243, Example 569
Type:
Small organic molecule
Emp. Form.:
C29H39N7O2
Mol. Mass.:
517.6657
SMILES:
CCOc1cc(-c2ccc(nc2)N2CCC(CN(C)C)(CC2)NC(=O)C(C)C(C)C)c2c(cnn2c1)C#N
: