Target
Serine/threonine-protein kinase mTOR
Ligand
BDBM315565
Substrate
Meas. Tech.
In vitro kinase assay
IC50
<5±n/a nM
Citation
 Liu, YRen, PJessen, KGuo, XRommel, C Combination pharmaceutical compositions and uses thereof US Patent  US10172858 Publication Date 1/8/2019 
Target
Name:
Serine/threonine-protein kinase mTOR
Synonyms:
FK506-binding protein 12-rapamycin complex-associated protein 1 FRAP FRAP1 MTOR Mammalian Target of Rapamycin (mTOR) RAFT1 Rapamycin and FKBP12 target 1 Serine/threonine-protein kinase (mTOR) | mTORC2
Type:
Rapamycin target protein
Mol. Mass.:
288917.12
Organism:
Homo sapiens (Human)
Description:
P42345
Residue:
2549
  
Inhibitor
Name:
BDBM315565
Synonyms:
US10172858, Table 2.62 | US9828378, # 62
Type:
Small organic molecule
Emp. Form.:
C18H18N6O2
Mol. Mass.:
350.3745
SMILES:
Nc1ncnc2n(nc(-c3cc4cccc(O)c4[nH]3)c12)C1CCOCC1
: