Target
Phosphatidylinositol 4,5-bisphosphate 3-kinase catalytic subunit gamma isoform
Ligand
BDBM315566
Substrate
Meas. Tech.
In vitro kinase assay
IC50
<25±n/a nM
Citation
 Liu, YRen, PJessen, KGuo, XRommel, C Combination pharmaceutical compositions and uses thereof US Patent  US10172858 Publication Date 1/8/2019 
Target
Name:
Phosphatidylinositol 4,5-bisphosphate 3-kinase catalytic subunit gamma isoform
Synonyms:
PI3-kinase p110 subunit gamma PI3Kgamma PK3CG_HUMAN Phosphatidylinositol 4,5-bisphosphate 3-kinase (PI3K) Phosphatidylinositol 4,5-bisphosphate 3-kinase catalytic subunit gamma (PI3Kgamma) Phosphatidylinositol 4,5-bisphosphate 3-kinase catalytic subunit gamma isoform (PI3K) Phosphatidylinositol-4,5-bisphosphate 3-kinase catalytic subunit gamma isoform Phosphoinositide 3-kinases gamma (PI3K gamma) p120-PI3K
Type:
Enzyme Subunit
Mol. Mass.:
126470.30
Organism:
Homo sapiens (Human)
Description:
P48736
Residue:
1102
  
Inhibitor
Name:
BDBM315566
Synonyms:
US10172858, Table 2.63 | US9828378, # 63
Type:
Small organic molecule
Emp. Form.:
C19H20N6O2
Mol. Mass.:
364.4011
SMILES:
COc1cccc2cc([nH]c12)-c1nn(C2CCOCC2)c2ncnc(N)c12
: