Target
Serine/threonine-protein kinase mTOR
Ligand
BDBM315567
Substrate
Meas. Tech.
In vitro kinase assay
IC50
<25±n/a nM
Citation
 Liu, YRen, PJessen, KGuo, XRommel, C Combination pharmaceutical compositions and uses thereof US Patent  US10172858 Publication Date 1/8/2019 
Target
Name:
Serine/threonine-protein kinase mTOR
Synonyms:
FK506-binding protein 12-rapamycin complex-associated protein 1 FRAP FRAP1 MTOR Mammalian Target of Rapamycin (mTOR) RAFT1 Rapamycin and FKBP12 target 1 Serine/threonine-protein kinase (mTOR) | mTORC2
Type:
Rapamycin target protein
Mol. Mass.:
288917.12
Organism:
Homo sapiens (Human)
Description:
P42345
Residue:
2549
  
Inhibitor
Name:
BDBM315567
Synonyms:
US10172858, Table 2.64 | US9828378, # 64
Type:
Small organic molecule
Emp. Form.:
C21H25N7O
Mol. Mass.:
391.4695
SMILES:
CC(C)N1CCC(CC1)n1nc(-c2cc3cccc(O)c3[nH]2)c2c(N)ncnc12
: