Target
Tyrosine-protein kinase JAK3
Ligand
BDBM316748
Substrate
Meas. Tech.
JAK Caliper Enzyme Assay
IC50
0.200±n/a nM
Citation
 Thorarensen, ABrown, MFCasimiro-Garcia, AChe, YCoe, JWFlanagan, MEGilbert, AMHayward, MMLangille, JDMontgomery, JITelliez, JUnwalla, RJTrujillo, JI Pyrrolo[2,3-d]pyrimidinyl, pyrrolo[2,3-b]pyrazinyl and pyrrolo[2,3-d]pyridinyl acrylamides US Patent  US9617258 Publication Date 4/11/2017 
Target
Name:
Tyrosine-protein kinase JAK3
Synonyms:
JAK-3 JAK3_HUMAN Janus kinase 3 (JAK3) L-JAK | Leukocyte janus kinase
Type:
Protein
Mol. Mass.:
125111.08
Organism:
Homo sapiens (Human)
Description:
P52333
Residue:
1124
  
Inhibitor
Name:
BDBM316748
Synonyms:
2-[(1-acryloylpiperidin-4-yl)amino]-N-(3,3-difluorocyclobutyl)-5H-pyrrolo[2,3-b]pyrazine-7-carboxamide US9617258, Example 245
Type:
Small organic molecule
Emp. Form.:
C19H22F2N6O2
Mol. Mass.:
404.4138
SMILES:
FC1(F)CC(C1)NC(=O)c1c[nH]c2ncc(NC3CCN(CC3)C(=O)C=C)nc12
: